Reaction Details
TargetPotassium voltage-gated channel subfamily H member 2
LigandBDBM50402107
Substrate/Competitorn/a
Meas. Tech.ChEMBL_884695 (CHEMBL2215143)
IC50 10000±n/a nM
Citation Furber, MAlcaraz, LLuckhurst, CBahl, ABeaton, HBowers, KCollington, JDenton, RDonald, DKinchin, EMacDonald, CRigby, ARiley, RSoars, MSpringthorpe, BWebborn, P Discovery and evolution of phenoxypiperidine hydroxyamide dual CCR3/H1 antagonists. Part II: optimising in vivo clearance. Bioorg Med Chem Lett22:7707-10 (2012) 
 
Potassium voltage-gated channel subfamily H member 2
Name:Potassium voltage-gated channel subfamily H member 2
Type:Multi-pass membrane protein
Mol. Mass.:126672.65
Organism:Homo sapiens (Human)
Description:Q12809
Residue:1159
BDBM50402107
NameBDBM50402107
Synonyms:CHEMBL2207663
TypeSmall organic molecule
Emp. Form.C22H25ClF3N3O4
Mol. Mass.487.9
SMILESCc1cc(Cl)ccc1OC1CCN(C[C@H](O)CNC(=O)c2c[nH]c(=O)cc2C(F)(F)F)CC1