Reaction Details
TargetHistamine H1 receptor
LigandBDBM50402126
Substrate/Competitorn/a
Meas. Tech.ChEMBL_884700 (CHEMBL2215148)
Ki 50.12±n/a nM
Citation Furber, MAlcaraz, LLuckhurst, CBahl, ABeaton, HBowers, KCollington, JDenton, RDonald, DKinchin, EMacDonald, CRigby, ARiley, RSoars, MSpringthorpe, BWebborn, P Discovery and evolution of phenoxypiperidine hydroxyamide dual CCR3/H1 antagonists. Part II: optimising in vivo clearance. Bioorg Med Chem Lett22:7707-10 (2012) 
 
Histamine H1 receptor
Name:Histamine H1 receptor
Type:G Protein-Coupled Receptor (GPCR)
Mol. Mass.:55808.72
Organism:Homo sapiens (Human)
Description:Cell pellets from SK-N-MC cells transfected with human H1 receptor were used in binding assay.
Residue:487
BDBM50402126
NameBDBM50402126
Synonyms:CHEMBL2207672
TypeSmall organic molecule
Emp. Form.C26H29Cl2N3O6S
Mol. Mass.582.496
SMILESCc1c(Cl)ccc(OC2CCN(C[C@H](O)CNC(=O)c3c[nH]c(=O)c4cc(ccc34)S(C)(=O)=O)CC2)c1Cl