Reaction Details
TargetC-C chemokine receptor type 3
LigandBDBM50402132
Substrate/Competitorn/a
Meas. Tech.ChEMBL_884699 (CHEMBL2215147)
Ki 3.98±n/a nM
Citation Furber, MAlcaraz, LLuckhurst, CBahl, ABeaton, HBowers, KCollington, JDenton, RDonald, DKinchin, EMacDonald, CRigby, ARiley, RSoars, MSpringthorpe, BWebborn, P Discovery and evolution of phenoxypiperidine hydroxyamide dual CCR3/H1 antagonists. Part II: optimising in vivo clearance. Bioorg Med Chem Lett22:7707-10 (2012) 
 
C-C chemokine receptor type 3
Name:C-C chemokine receptor type 3
Type:Enzyme
Mol. Mass.:41053.88
Organism:Homo sapiens (Human)
Description:P51677
Residue:355
BDBM50402132
NameBDBM50402132
Synonyms:CHEMBL2207665
TypeSmall organic molecule
Emp. Form.C22H24Cl2F3N3O4
Mol. Mass.522.345
SMILESCn1cc(C(=O)NC[C@@H](O)CN2CCC(CC2)Oc2ccc(Cl)c(Cl)c2)c(cc1=O)C(F)(F)F