Reaction Details
TargetC-C chemokine receptor type 3
LigandBDBM50402133
Substrate/Competitorn/a
Meas. Tech.ChEMBL_884699 (CHEMBL2215147)
Ki 1.26±n/a nM
Citation Furber, MAlcaraz, LLuckhurst, CBahl, ABeaton, HBowers, KCollington, JDenton, RDonald, DKinchin, EMacDonald, CRigby, ARiley, RSoars, MSpringthorpe, BWebborn, P Discovery and evolution of phenoxypiperidine hydroxyamide dual CCR3/H1 antagonists. Part II: optimising in vivo clearance. Bioorg Med Chem Lett22:7707-10 (2012) 
 
C-C chemokine receptor type 3
Name:C-C chemokine receptor type 3
Type:Enzyme
Mol. Mass.:41053.88
Organism:Homo sapiens (Human)
Description:P51677
Residue:355
BDBM50402133
NameBDBM50402133
Synonyms:CHEMBL2207664
TypeSmall organic molecule
Emp. Form.C22H24Cl2F3N3O4
Mol. Mass.522.345
SMILESCc1c(Cl)ccc(OC2CCN(C[C@H](O)CNC(=O)c3c[nH]c(=O)cc3C(F)(F)F)CC2)c1Cl