Reaction Details
TargetC-C chemokine receptor type 3
LigandBDBM50402118
Substrate/Competitorn/a
Meas. Tech.ChEMBL_884699 (CHEMBL2215147)
Ki 1±n/a nM
Citation Furber, MAlcaraz, LLuckhurst, CBahl, ABeaton, HBowers, KCollington, JDenton, RDonald, DKinchin, EMacDonald, CRigby, ARiley, RSoars, MSpringthorpe, BWebborn, P Discovery and evolution of phenoxypiperidine hydroxyamide dual CCR3/H1 antagonists. Part II: optimising in vivo clearance. Bioorg Med Chem Lett22:7707-10 (2012) 
 
C-C chemokine receptor type 3
Name:C-C chemokine receptor type 3
Type:Enzyme
Mol. Mass.:41053.88
Organism:Homo sapiens (Human)
Description:P51677
Residue:355
BDBM50402118
NameBDBM50402118
Synonyms:CHEMBL2207283
TypeSmall organic molecule
Emp. Form.C26H29Cl2N3O6S
Mol. Mass.582.496
SMILESCc1c(Cl)ccc(OC2CCN(C[C@H](O)CNC(=O)c3c[nH]c(=O)c4ccc(cc34)S(C)(=O)=O)CC2)c1Cl