Reaction Details
TargetPotassium voltage-gated channel subfamily H member 2
LigandBDBM50402133
Substrate/Competitorn/a
Meas. Tech.ChEMBL_884698 (CHEMBL2215146)
IC50 5011.87±n/a nM
Citation Furber, MAlcaraz, LLuckhurst, CBahl, ABeaton, HBowers, KCollington, JDenton, RDonald, DKinchin, EMacDonald, CRigby, ARiley, RSoars, MSpringthorpe, BWebborn, P Discovery and evolution of phenoxypiperidine hydroxyamide dual CCR3/H1 antagonists. Part II: optimising in vivo clearance. Bioorg Med Chem Lett22:7707-10 (2012) 
 
Potassium voltage-gated channel subfamily H member 2
Name:Potassium voltage-gated channel subfamily H member 2
Type:Multi-pass membrane protein
Mol. Mass.:126672.65
Organism:Homo sapiens (Human)
Description:Q12809
Residue:1159
BDBM50402133
NameBDBM50402133
Synonyms:CHEMBL2207664
TypeSmall organic molecule
Emp. Form.C22H24Cl2F3N3O4
Mol. Mass.522.345
SMILESCc1c(Cl)ccc(OC2CCN(C[C@H](O)CNC(=O)c3c[nH]c(=O)cc3C(F)(F)F)CC2)c1Cl