Reaction Details
TargetPotassium voltage-gated channel subfamily H member 2
LigandBDBM50402121
Substrate/Competitorn/a
Meas. Tech.ChEMBL_884698 (CHEMBL2215146)
IC50 1258.93±n/a nM
Citation Furber, MAlcaraz, LLuckhurst, CBahl, ABeaton, HBowers, KCollington, JDenton, RDonald, DKinchin, EMacDonald, CRigby, ARiley, RSoars, MSpringthorpe, BWebborn, P Discovery and evolution of phenoxypiperidine hydroxyamide dual CCR3/H1 antagonists. Part II: optimising in vivo clearance. Bioorg Med Chem Lett22:7707-10 (2012) 
 
Potassium voltage-gated channel subfamily H member 2
Name:Potassium voltage-gated channel subfamily H member 2
Type:Multi-pass membrane protein
Mol. Mass.:126672.65
Organism:Homo sapiens (Human)
Description:Q12809
Residue:1159
BDBM50402121
NameBDBM50402121
Synonyms:CHEMBL2207280
TypeSmall organic molecule
Emp. Form.C24H24Cl2FN3O4
Mol. Mass.508.369
SMILESO[C@H](CNC(=O)c1c[nH]c(=O)c2ccc(F)cc12)CN1CCC(CC1)Oc1ccc(Cl)c(Cl)c1