Reaction Details
TargetKappa-type opioid receptor
LigandBDBM50402141
Substrate/Competitorn/a
Meas. Tech.ChEMBL_884720 (CHEMBL2215601)
Ki 16.7±n/a nM
Citation Fujii, HNakajima, RAkiyama, JYamamoto, NHirayama, SNemoto, TGouda, HHirono, SNagase, H Synthesis of new opioid derivatives with a propellane skeleton and their pharmacologies: part 3, novel propellane derivatives with pentacyclic skeletons. Bioorg Med Chem Lett22:7697-701 (2012) 
 
Kappa-type opioid receptor
Name:Kappa-type opioid receptor
Type:Enzyme
Mol. Mass.:42656.78
Organism:Mus musculus (Mouse)
Description:P33534
Residue:380
BDBM50402141
NameBDBM50402141
Synonyms:CHEMBL2207681
TypeSmall organic molecule
Emp. Form.C22H27NO3
Mol. Mass.353.4547
SMILESO[C@H]1CC2N(CC3CC3)CCC34CC(=O)C1CC23Cc1ccc(O)cc41