Reaction Details
TargetDelta-type opioid receptor
LigandBDBM50402140
Substrate/Competitorn/a
Meas. Tech.ChEMBL_884721 (CHEMBL2215602)
Ki 67.9±n/a nM
Citation Fujii, HNakajima, RAkiyama, JYamamoto, NHirayama, SNemoto, TGouda, HHirono, SNagase, H Synthesis of new opioid derivatives with a propellane skeleton and their pharmacologies: part 3, novel propellane derivatives with pentacyclic skeletons. Bioorg Med Chem Lett22:7697-701 (2012) 
 
Delta-type opioid receptor
Name:Delta-type opioid receptor
Type:Enzyme Catalytic Domain
Mol. Mass.:40577.25
Organism:MOUSE
Description:P32300
Residue:372
BDBM50402140
NameBDBM50402140
Synonyms:CHEMBL2207680
TypeSmall organic molecule
Emp. Form.C22H27NO3
Mol. Mass.353.4547
SMILESO[C@@H]1CC2N(CC3CC3)CCC34CC(=O)C1CC23Cc1ccc(O)cc41