Reaction Details
TargetTGF-beta receptor type-1
LigandBDBM50402177
Substrate/Competitorn/a
Meas. Tech.ChEMBL_885031 (CHEMBL2211755)
IC50 11±n/a nM
Citation Amada, HSekiguchi, YOno, NKoami, TTakayama, TYabuuchi, TKatakai, HIkeda, AAoki, MNaruse, TWada, RNozoe, ASato, M 5-(1,3-Benzothiazol-6-yl)-4-(4-methyl-1,3-thiazol-2-yl)-1H-imidazole derivatives as potent and selective transforming growth factor-ß type I receptor inhibitors. Bioorg Med Chem20:7128-38 (2012) 
 
TGF-beta receptor type-1
Name:TGF-beta receptor type-1
Type:enzyme
Mol. Mass.:55968.24
Organism:Homo sapiens (Human)
Description:P36897
Residue:503
BDBM50402177
NameBDBM50402177
Synonyms:CHEMBL2208014
TypeSmall organic molecule
Emp. Form.C18H18N6OS2
Mol. Mass.398.505
SMILESCCNC(=O)NCc1nc(c([nH]1)-c1nc(C)cs1)-c1ccc2ncsc2c1