Reaction Details
TargetLactoylglutathione lyase
LigandBDBM50402202
Substrate/Competitorn/a
Meas. Tech.ChEMBL_885082 (CHEMBL2212266)
IC50 11±n/a nM
Citation Chiba, TOhwada, JSakamoto, HKobayashi, TFukami, TAIrie, MMiura, TOhara, KKoyano, H Design and evaluation of azaindole-substituted N-hydroxypyridones as glyoxalase I inhibitors. Bioorg Med Chem Lett22:7486-9 (2012) 
 
Lactoylglutathione lyase
Name:Lactoylglutathione lyase
Type:Enzyme
Mol. Mass.:20772.95
Organism:Homo sapiens (Human)
Description:Q04760
Residue:184
BDBM50402202
NameBDBM50402202
Synonyms:CHEMBL2203964
TypeSmall organic molecule
Emp. Form.C22H21N3O3
Mol. Mass.375.4204
SMILESCOCCCn1ccc2cc(cnc12)-c1cc(cc(=O)n1O)-c1ccccc1