Reaction Details
TargetLactoylglutathione lyase
LigandBDBM50402205
Substrate/Competitorn/a
Meas. Tech.ChEMBL_885082 (CHEMBL2212266)
IC50 480±n/a nM
Citation Chiba, TOhwada, JSakamoto, HKobayashi, TFukami, TAIrie, MMiura, TOhara, KKoyano, H Design and evaluation of azaindole-substituted N-hydroxypyridones as glyoxalase I inhibitors. Bioorg Med Chem Lett22:7486-9 (2012) 
 
Lactoylglutathione lyase
Name:Lactoylglutathione lyase
Type:Enzyme
Mol. Mass.:20772.95
Organism:Homo sapiens (Human)
Description:Q04760
Residue:184
BDBM50402205
NameBDBM50402205
Synonyms:CHEMBL2203977
TypeSmall organic molecule
Emp. Form.C27H21N3O3
Mol. Mass.435.4739
SMILESNC(=O)c1cccc(Cn2ccc3cc(ccc23)-c2cc(cc(=O)n2O)-c2ccccc2)c1