Reaction Details
TargetRenin
LigandBDBM50402219
Substrate/Competitorn/a
Meas. Tech.ChEMBL_885261 (CHEMBL2214689)
IC50 1.3±n/a nM
Citation Mori, YOgawa, YMochizuki, ANakamura, YSugita, CMiyazaki, STamaki, KMatsui, YTakahashi, MNagayama, TNagai, YInoue, SNishi, T Design and discovery of new (3S,5R)-5-[4-(2-chlorophenyl)-2,2-dimethyl-5-oxopiperazin-1-yl]piperidine-3-carboxamides as potent renin inhibitors. Bioorg Med Chem Lett22:7677-82 (2012) 
 
Renin
Name:Renin
Type:Enzyme
Mol. Mass.:45058.99
Organism:Homo sapiens (Human)
Description:n/a
Residue:406
BDBM50402219
NameBDBM50402219
Synonyms:CHEMBL2204732
TypeSmall organic molecule
Emp. Form.C26H41ClN4O3
Mol. Mass.493.082
SMILESCCOC[C@@H](CC(C)C)NC(=O)[C@@H]1CNC[C@@H](C1)N1CC(=O)N(CC1(C)C)c1ccccc1Cl