Reaction Details
TargetXanthine dehydrogenase/oxidase
LigandBDBM35440
Substrate/Competitorn/a
Meas. Tech.ChEMBL_885467 (CHEMBL2209519)
IC50 4190±n/a nM
Citation Khanna, SBurudkar, SBajaj, KShah, PKeche, AGhosh, UDesai, ASrivastava, AKulkarni-Almeida, ADeshmukh, NJDixit, ABrahma, MKBahirat, UDoshi, LNemmani, KVTannu, PDamre, AB-Rao, CSharma, RSivaramakrishnan, H Isocytosine-based inhibitors of xanthine oxidase: design, synthesis, SAR, PK and in vivo efficacy in rat model of hyperuricemia. Bioorg Med Chem Lett22:7543-6 (2012) 
 
Xanthine dehydrogenase/oxidase
Name:Xanthine dehydrogenase/oxidase
Type:Enzyme
Mol. Mass.:146441.21
Organism:Homo sapiens (Human)
Description:P47989
Residue:1333
BDBM35440
NameBDBM35440
Synonyms:ALLOPURINOL SMR000059083 | cid_2094
TypeSmall organic molecule
Emp. Form.C5H4N4O
Mol. Mass.136.1115
SMILESO=c1[nH]cnc2n[nH]cc12