Reaction Details
TargetIndoleamine 2,3-dioxygenase 1
LigandBDBM50092055
Substrate/Competitorn/a
Meas. Tech.ChEMBL_885589 (CHEMBL2210858)
IC50 59900±n/a nM
Citation Bakmiwewa, SMFatokun, AATran, APayne, RJHunt, NHBall, HJ Identification of selective inhibitors of indoleamine 2,3-dioxygenase 2. Bioorg Med Chem Lett22:7641-6 (2012) 
 
Indoleamine 2,3-dioxygenase 1
Name:Indoleamine 2,3-dioxygenase 1
Type:PROTEIN
Mol. Mass.:45639.39
Organism:Mus musculus
Description:ChEMBL_1452149
Residue:407
BDBM50092055
NameBDBM50092055
Synonyms:(2E,4E,6E,8E)-3,7-Dimethyl-9-(2,6,6-trimethyl-cyclohex-1-enyl)-nona-2,4,6,8-tetraenoic acid (4-hydroxy-phenyl)-amide 3,7-Dimethyl-9-(2,6,6-trimethyl-cyclohex-1-enyl)-nona-2,4,6,8-tetraenoic acid (4-hydroxy-phenyl)-amide CHEMBL7301 N-(4-HYDROXYPHENYL)ALL-TRANS RETINAMIDE N-(4-hydroxyphenyl)retinamide | N-(4-hydroxyphenyl)retinamide, 4-HPR
TypeSmall organic molecule
Emp. Form.C26H33NO2
Mol. Mass.391.5457
SMILESC\C(\C=C\C1=C(C)CCCC1(C)C)=C/C=C/C(/C)=C/C(=O)Nc1ccc(O)cc1