Reaction Details
TargetIndoleamine 2,3-dioxygenase 1
LigandBDBM50336640
Substrate/Competitorn/a
Meas. Tech.ChEMBL_885589 (CHEMBL2210858)
IC50 46000±n/a nM
Citation Bakmiwewa, SMFatokun, AATran, APayne, RJHunt, NHBall, HJ Identification of selective inhibitors of indoleamine 2,3-dioxygenase 2. Bioorg Med Chem Lett22:7641-6 (2012) 
 
Indoleamine 2,3-dioxygenase 1
Name:Indoleamine 2,3-dioxygenase 1
Type:PROTEIN
Mol. Mass.:45639.39
Organism:Mus musculus
Description:ChEMBL_1452149
Residue:407
BDBM50336640
NameBDBM50336640
Synonyms:(nifedipine) 2,6-Dimethyl-4-(2-nitro-phenyl)-1,4-dihydro-pyridine-3,5-dicarboxylic acid dimethyl ester Adalat Afeditab cr NIFEDIPINE Procardia dimethyl 2,6-dimethyl-4-(2-nitrophenyl)-1,4-dihydropyridine-3,5-dicarboxylate
TypeSmall organic molecule
Emp. Form.C17H18N2O6
Mol. Mass.346.3346
SMILESCOC(=O)C1C(C(C(=O)OC)=C(C)N=C1C)c1ccccc1[N+]([O-])=O