Reaction Details
TargetAngiopoietin-1 receptor
LigandBDBM50402339
Substrate/Competitorn/a
Meas. Tech.ChEMBL_885941 (CHEMBL2215703)
IC50 5100±n/a nM
Citation Miyamoto, NOguro, YTakagi, TIwata, HMiki, HHori, AImamura, S Design, synthesis, and evaluation of imidazo[1,2-b]pyridazine derivatives having a benzamide unit as novel VEGFR2 kinase inhibitors. Bioorg Med Chem20:7051-8 (2012) 
 
Angiopoietin-1 receptor
Name:Angiopoietin-1 receptor
Type:Enzyme
Mol. Mass.:125835.70
Organism:Homo sapiens (Human)
Description:Q02763
Residue:1124
BDBM50402339
NameBDBM50402339
Synonyms:CHEMBL2206666
TypeSmall organic molecule
Emp. Form.C20H13F3N4O2
Mol. Mass.398.338
SMILESFC(F)(F)c1cccc(c1)C(=O)Nc1cccc(Oc2ccc3nccn3n2)c1