Reaction Details
TargetPlatelet-derived growth factor receptor alpha
LigandBDBM50402339
Substrate/Competitorn/a
Meas. Tech.ChEMBL_885951 (CHEMBL2215713)
IC50 13±n/a nM
Citation Miyamoto, NOguro, YTakagi, TIwata, HMiki, HHori, AImamura, S Design, synthesis, and evaluation of imidazo[1,2-b]pyridazine derivatives having a benzamide unit as novel VEGFR2 kinase inhibitors. Bioorg Med Chem20:7051-8 (2012) 
 
Platelet-derived growth factor receptor alpha
Name:Platelet-derived growth factor receptor alpha
Type:Protein
Mol. Mass.:122633.38
Organism:Homo sapiens (Human)
Description:P16234
Residue:1089
BDBM50402339
NameBDBM50402339
Synonyms:CHEMBL2206666
TypeSmall organic molecule
Emp. Form.C20H13F3N4O2
Mol. Mass.398.338
SMILESFC(F)(F)c1cccc(c1)C(=O)Nc1cccc(Oc2ccc3nccn3n2)c1