Reaction Details
TargetVascular endothelial growth factor receptor 2
LigandBDBM50402347
Substrate/Competitorn/a
Meas. Tech.ChEMBL_885952 (CHEMBL2215714)
IC50 5200±n/a nM
Citation Miyamoto, NOguro, YTakagi, TIwata, HMiki, HHori, AImamura, S Design, synthesis, and evaluation of imidazo[1,2-b]pyridazine derivatives having a benzamide unit as novel VEGFR2 kinase inhibitors. Bioorg Med Chem20:7051-8 (2012) 
 
Vascular endothelial growth factor receptor 2
Name:Vascular endothelial growth factor receptor 2
Type:Receptor Tyrosine Kinase
Mol. Mass.:151510.97
Organism:Homo sapiens (Human)
Description:P35968
Residue:1356
BDBM50402347
NameBDBM50402347
Synonyms:CHEMBL2206661
TypeSmall organic molecule
Emp. Form.C19H15N5O2
Mol. Mass.345.3547
SMILESO=C(Nc1ccccc1)Nc1ccc(Oc2ccc3nccn3n2)cc1