Reaction Details
TargetUrokinase plasminogen activator surface receptor
LigandBDBM50402360
Substrate/Competitorn/a
Meas. Tech.ChEMBL_886136 (CHEMBL2210436)
Ki 0.002±n/a nM
Citation Omar, MAShaker, YMGalal, SAAli, MMKerwin, SMLi, JTokuda, HRamadan, RAEl Diwani, HI Synthesis and docking studies of novel antitumor benzimidazoles. Bioorg Med Chem20:6989-7001 (2012) 
 
Urokinase plasminogen activator surface receptor
Name:Urokinase plasminogen activator surface receptor
Type:Receptor
Mol. Mass.:36979.14
Organism:Homo sapiens (Human)
Description:Q03405
Residue:335
BDBM50402360
NameBDBM50402360
Synonyms:CHEMBL2206681
TypeSmall organic molecule
Emp. Form.C25H20N6
Mol. Mass.404.4665
SMILESNc1c(cc(-c2ccccc2)n1Cc1nc2ccccc2[nH]1)-c1nc2ccccc2[nH]1