Reaction Details
TargetLeukotriene A-4 hydrolase
LigandBDBM50402388
Substrate/Competitorn/a
Meas. Tech.ChEMBL_886318 (CHEMBL2212808)
IC50 6±n/a nM
Citation Tanis, VMBacani, GMBlevitt, JMChrovian, CCCrawford, SDe Leon, AFourie, AMGomez, LGrice, CAHerman, KKearney, AMLandry-Bayle, AMLee-Dutra, ANelson, JRiley, JPSantillán, AWiener, JJXue, XYoung, AL Azabenzthiazole inhibitors of leukotriene A4 hydrolase. Bioorg Med Chem Lett22:7504-11 (2012) 
 
Leukotriene A-4 hydrolase
Name:Leukotriene A-4 hydrolase
Type:Hydrolase; metalloprotease
Mol. Mass.:69280.41
Organism:Homo sapiens (Human)
Description:Human recombinant LTA4H.
Residue:611
BDBM50402388
NameBDBM50402388
Synonyms:CHEMBL2207745
TypeSmall organic molecule
Emp. Form.C22H24N4O2S
Mol. Mass.408.517
SMILESCC(=O)N1CC2CN(CCc3ccc(Oc4nc5ncccc5s4)cc3)CC2C1