Reaction Details
TargetLeukotriene A-4 hydrolase
LigandBDBM50402389
Substrate/Competitorn/a
Meas. Tech.ChEMBL_886318 (CHEMBL2212808)
IC50 14±n/a nM
Citation Tanis, VMBacani, GMBlevitt, JMChrovian, CCCrawford, SDe Leon, AFourie, AMGomez, LGrice, CAHerman, KKearney, AMLandry-Bayle, AMLee-Dutra, ANelson, JRiley, JPSantillán, AWiener, JJXue, XYoung, AL Azabenzthiazole inhibitors of leukotriene A4 hydrolase. Bioorg Med Chem Lett22:7504-11 (2012) 
 
Leukotriene A-4 hydrolase
Name:Leukotriene A-4 hydrolase
Type:Hydrolase; metalloprotease
Mol. Mass.:69280.41
Organism:Homo sapiens (Human)
Description:Human recombinant LTA4H.
Residue:611
BDBM50402389
NameBDBM50402389
Synonyms:CHEMBL2207744
TypeSmall organic molecule
Emp. Form.C23H26N4O2S
Mol. Mass.422.543
SMILESO=C1CCCN1C1CCN(CCc2ccc(Oc3nc4ncccc4s3)cc2)CC1