Reaction Details
TargetLeukotriene A-4 hydrolase
LigandBDBM50402392
Substrate/Competitorn/a
Meas. Tech.ChEMBL_886318 (CHEMBL2212808)
IC50 4±n/a nM
Citation Tanis, VMBacani, GMBlevitt, JMChrovian, CCCrawford, SDe Leon, AFourie, AMGomez, LGrice, CAHerman, KKearney, AMLandry-Bayle, AMLee-Dutra, ANelson, JRiley, JPSantillán, AWiener, JJXue, XYoung, AL Azabenzthiazole inhibitors of leukotriene A4 hydrolase. Bioorg Med Chem Lett22:7504-11 (2012) 
 
Leukotriene A-4 hydrolase
Name:Leukotriene A-4 hydrolase
Type:Hydrolase; metalloprotease
Mol. Mass.:69280.41
Organism:Homo sapiens (Human)
Description:Human recombinant LTA4H.
Residue:611
BDBM50402392
NameBDBM50402392
Synonyms:CHEMBL2207741
TypeSmall organic molecule
Emp. Form.C23H26N4O3S
Mol. Mass.438.543
SMILESCC(=O)NC1CC2CCC(C1)N2CCOc1ccc(Oc2nc3ncccc3s2)cc1