Reaction Details
TargetPotassium voltage-gated channel subfamily H member 2
LigandBDBM50402382
Substrate/Competitorn/a
Meas. Tech.ChEMBL_886196 (CHEMBL2210904)
IC50>10000±n/a nM
Citation Tanis, VMBacani, GMBlevitt, JMChrovian, CCCrawford, SDe Leon, AFourie, AMGomez, LGrice, CAHerman, KKearney, AMLandry-Bayle, AMLee-Dutra, ANelson, JRiley, JPSantillán, AWiener, JJXue, XYoung, AL Azabenzthiazole inhibitors of leukotriene A4 hydrolase. Bioorg Med Chem Lett22:7504-11 (2012) 
 
Potassium voltage-gated channel subfamily H member 2
Name:Potassium voltage-gated channel subfamily H member 2
Type:Multi-pass membrane protein
Mol. Mass.:126672.65
Organism:Homo sapiens (Human)
Description:Q12809
Residue:1159
BDBM50402382
NameBDBM50402382
Synonyms:CHEMBL2207751
TypeSmall organic molecule
Emp. Form.C22H24N4O2S
Mol. Mass.408.517
SMILESCC(=O)NC1CC2CCC(C1)N2Cc1ccc(Oc2nc3ncccc3s2)cc1