Reaction Details
TargetPotassium voltage-gated channel subfamily H member 2
LigandBDBM50402396
Substrate/Competitorn/a
Meas. Tech.ChEMBL_886196 (CHEMBL2210904)
IC50>10000±n/a nM
Citation Tanis, VMBacani, GMBlevitt, JMChrovian, CCCrawford, SDe Leon, AFourie, AMGomez, LGrice, CAHerman, KKearney, AMLandry-Bayle, AMLee-Dutra, ANelson, JRiley, JPSantillán, AWiener, JJXue, XYoung, AL Azabenzthiazole inhibitors of leukotriene A4 hydrolase. Bioorg Med Chem Lett22:7504-11 (2012) 
 
Potassium voltage-gated channel subfamily H member 2
Name:Potassium voltage-gated channel subfamily H member 2
Type:Multi-pass membrane protein
Mol. Mass.:126672.65
Organism:Homo sapiens (Human)
Description:Q12809
Residue:1159
BDBM50402396
NameBDBM50402396
Synonyms:CHEMBL2207737
TypeSmall organic molecule
Emp. Form.C20H22N4O3S
Mol. Mass.398.479
SMILESNC(=O)C1CCN(CCOc2ccc(Oc3nc4ncccc4s3)cc2)CC1