Reaction Details
TargetPotassium voltage-gated channel subfamily H member 2
LigandBDBM50402405
Substrate/Competitorn/a
Meas. Tech.ChEMBL_886194 (CHEMBL2210902)
IC50>10000±n/a nM
Citation Tanis, VMBacani, GMBlevitt, JMChrovian, CCCrawford, SDe Leon, AFourie, AMGomez, LGrice, CAHerman, KKearney, AMLandry-Bayle, AMLee-Dutra, ANelson, JRiley, JPSantillán, AWiener, JJXue, XYoung, AL Azabenzthiazole inhibitors of leukotriene A4 hydrolase. Bioorg Med Chem Lett22:7504-11 (2012) 
 
Potassium voltage-gated channel subfamily H member 2
Name:Potassium voltage-gated channel subfamily H member 2
Type:Multi-pass membrane protein
Mol. Mass.:126672.65
Organism:Homo sapiens (Human)
Description:Q12809
Residue:1159
BDBM50402405
NameBDBM50402405
Synonyms:CHEMBL2207752
TypeSmall organic molecule
Emp. Form.C19H20N4O2S
Mol. Mass.368.453
SMILESNC(=O)C1CCN(Cc2ccc(Oc3nc4ncccc4s3)cc2)CC1