Reaction Details
TargetTyrosine-protein kinase JAK2
LigandBDBM50402428
Substrate/Competitorn/a
Meas. Tech.ChEMBL_886510 (CHEMBL2214785)
IC50>30000±n/a nM
Citation Forsyth, TKearney, PCKim, BGJohnson, HWAay, NArcalas, ABrown, DSChan, VChen, JDu, HEpshteyn, SGalan, AAHuynh, TPIbrahim, MAKane, BKoltun, ESMann, GMeyr, LELee, MSLewis, GLNoguchi, RTPack, MRidgway, BHShi, XTakeuchi, CSZu, PLeahy, JWNuss, JMAoyama, REngst, SGendreau, SBKassees, RLi, JLin, SHMartini, JFStout, TTong, PWoolfrey, JZhang, WYu, P SAR and in vivo evaluation of 4-aryl-2-aminoalkylpyrimidines as potent and selective Janus kinase 2 (JAK2) inhibitors. Bioorg Med Chem Lett22:7653-8 (2012) 
 
Tyrosine-protein kinase JAK2
Name:Tyrosine-protein kinase JAK2
Type:Protein
Mol. Mass.:130684.68
Organism:Homo sapiens (Human)
Description:O60674
Residue:1132
BDBM50402428
NameBDBM50402428
Synonyms:CHEMBL2207765
TypeSmall organic molecule
Emp. Form.C24H18Cl2N6O2
Mol. Mass.493.345
SMILESCC(=O)Nc1ccc(cc1)-c1ccnc(Nc2cccc(NC(=O)c3c(Cl)cccc3Cl)n2)n1