Reaction Details
TargetTyrosine-protein kinase JAK3
LigandBDBM50402419
Substrate/Competitorn/a
Meas. Tech.ChEMBL_886511 (CHEMBL2214786)
IC50>980±n/a nM
Citation Forsyth, TKearney, PCKim, BGJohnson, HWAay, NArcalas, ABrown, DSChan, VChen, JDu, HEpshteyn, SGalan, AAHuynh, TPIbrahim, MAKane, BKoltun, ESMann, GMeyr, LELee, MSLewis, GLNoguchi, RTPack, MRidgway, BHShi, XTakeuchi, CSZu, PLeahy, JWNuss, JMAoyama, REngst, SGendreau, SBKassees, RLi, JLin, SHMartini, JFStout, TTong, PWoolfrey, JZhang, WYu, P SAR and in vivo evaluation of 4-aryl-2-aminoalkylpyrimidines as potent and selective Janus kinase 2 (JAK2) inhibitors. Bioorg Med Chem Lett22:7653-8 (2012) 
 
Tyrosine-protein kinase JAK3
Name:Tyrosine-protein kinase JAK3
Type:Protein
Mol. Mass.:125111.08
Organism:Homo sapiens (Human)
Description:P52333
Residue:1124
BDBM50402419
NameBDBM50402419
Synonyms:CHEMBL2207764
TypeSmall organic molecule
Emp. Form.C25H19Cl2N5O2
Mol. Mass.492.357
SMILESCC(=O)Nc1ccc(cc1)-c1ccnc(Nc2cccc(NC(=O)c3c(Cl)cccc3Cl)c2)n1