Reaction Details
TargetNeuropeptide FF receptor 2
LigandBDBM50402457
Substrate/Competitorn/a
Meas. Tech.ChEMBL_886539 (CHEMBL2215248)
Ki 22±n/a nM
Citation Gealageas, RSchneider, SHumbert, JPBertin, ISchmitt, MLaboureyras, EDugave, CMollereau, CSimonnet, GBourguignon, JJSimonin, FBihel, F Development of sub-nanomolar dipeptidic ligands of neuropeptide FF receptors. Bioorg Med Chem Lett22:7471-4 (2012) 
 
Neuropeptide FF receptor 2
Name:Neuropeptide FF receptor 2
Type:Enzyme Catalytic Domain
Mol. Mass.:60293.78
Organism:Homo sapiens (Human)
Description:NPFF2 0 HUMAN::Q9Y5X5
Residue:522
BDBM50402457
NameBDBM50402457
Synonyms:CHEMBL2208340
TypeSmall organic molecule
Emp. Form.C22H28N6O3
Mol. Mass.424.4961
SMILES[#7]\[#6](-[#7])=[#7]\[#6]-[#6]-[#6]-[#6@@H](-[#7]-[#6](=O)-c1ccccc1)-[#6](=O)-[#7]-[#6@@H](-[#6]-c1ccccc1)-[#6](-[#7])=O