Reaction Details
TargetNeuropeptide FF receptor 1
LigandBDBM50402451
Substrate/Competitorn/a
Meas. Tech.ChEMBL_886542 (CHEMBL2215251)
Ki 6±n/a nM
Citation Gealageas, RSchneider, SHumbert, JPBertin, ISchmitt, MLaboureyras, EDugave, CMollereau, CSimonnet, GBourguignon, JJSimonin, FBihel, F Development of sub-nanomolar dipeptidic ligands of neuropeptide FF receptors. Bioorg Med Chem Lett22:7471-4 (2012) 
 
Neuropeptide FF receptor 1
Name:Neuropeptide FF receptor 1
Type:PROTEIN
Mol. Mass.:47840.07
Organism:Homo sapiens (Human)
Description:ChEMBL_1474637
Residue:430
BDBM50402451
NameBDBM50402451
Synonyms:CHEMBL2208322
TypeSmall organic molecule
Emp. Form.C28H32N6O3
Mol. Mass.500.5921
SMILES[#7]\[#6](-[#7])=[#7]\[#6]-[#6]-[#6]-[#6@@H](-[#7]-[#6](=O)-c1cccc(c1)-c1ccccc1)-[#6](=O)-[#7]-[#6@@H](-[#6]-c1ccccc1)-[#6](-[#7])=O