Reaction Details
TargetDelta-type opioid receptor
LigandBDBM50402468
Substrate/Competitorn/a
Meas. Tech.ChEMBL_886624 (CHEMBL2216209)
Ki 848±n/a nM
Citation Wada, NFujii, HKoyano, KHirayama, SIwai, TNemoto, TNagase, H Synthesis of novel triplet drugs with 1,3,5-trioxazatriquinane skeletons and their pharmacologies. 3: synthesis of novel triplet drugs with the bis(epoxymethano) or bis(dimethylepoxymethano) structure (double-capped triplet). Bioorg Med Chem Lett22:7551-4 (2012) 
 
Delta-type opioid receptor
Name:Delta-type opioid receptor
Type:Enzyme Catalytic Domain
Mol. Mass.:40577.25
Organism:MOUSE
Description:P32300
Residue:372
BDBM50402468
NameBDBM50402468
Synonyms:CHEMBL2204034
TypeSmall organic molecule
Emp. Form.C25H32N2O6
Mol. Mass.456.5314
SMILESCC(C)CN1CC[C@@]23[C@H]4Oc5c2c(C[C@@H]1[C@]3(O)CC[C@]41O[C@H]2CO[C@H]3CO[C@@H]1N23)ccc5O