Reaction Details
TargetMu-type opioid receptor
LigandBDBM50402464
Substrate/Competitorn/a
Meas. Tech.ChEMBL_886625 (CHEMBL2216210)
Ki 581±n/a nM
Citation Wada, NFujii, HKoyano, KHirayama, SIwai, TNemoto, TNagase, H Synthesis of novel triplet drugs with 1,3,5-trioxazatriquinane skeletons and their pharmacologies. 3: synthesis of novel triplet drugs with the bis(epoxymethano) or bis(dimethylepoxymethano) structure (double-capped triplet). Bioorg Med Chem Lett22:7551-4 (2012) 
 
Mu-type opioid receptor
Name:Mu-type opioid receptor
Type:Enzyme Catalytic Domain
Mol. Mass.:44431.62
Organism:MOUSE
Description:OPIATE Mu OPRM1 MOUSE::P42866
Residue:398
BDBM50402464
NameBDBM50402464
Synonyms:CHEMBL2204022
TypeSmall organic molecule
Emp. Form.C28H30N2O6
Mol. Mass.490.5476
SMILESOc1ccc2C[C@H]3N(Cc4ccccc4)CC[C@@]45[C@@H](Oc1c24)[C@]1(CC[C@@]35O)O[C@H]2CO[C@H]3CO[C@@H]1N23