Reaction Details
TargetDelta-type opioid receptor
LigandBDBM50402473
Substrate/Competitorn/a
Meas. Tech.ChEMBL_886624 (CHEMBL2216209)
Ki 22±n/a nM
Citation Wada, NFujii, HKoyano, KHirayama, SIwai, TNemoto, TNagase, H Synthesis of novel triplet drugs with 1,3,5-trioxazatriquinane skeletons and their pharmacologies. 3: synthesis of novel triplet drugs with the bis(epoxymethano) or bis(dimethylepoxymethano) structure (double-capped triplet). Bioorg Med Chem Lett22:7551-4 (2012) 
 
Delta-type opioid receptor
Name:Delta-type opioid receptor
Type:Enzyme Catalytic Domain
Mol. Mass.:40577.25
Organism:MOUSE
Description:P32300
Residue:372
BDBM50402473
NameBDBM50402473
Synonyms:CHEMBL2204028
TypeSmall organic molecule
Emp. Form.C29H38N2O6
Mol. Mass.510.6218
SMILESCC1(C)O[C@@H]2N3[C@H]1O[C@]1(CC[C@@]4(O)[C@H]5Cc6ccc(O)c7O[C@@H]1[C@]4(CCN5CC1CC1)c67)[C@@H]3OC2(C)C