Reaction Details
TargetGlucocorticoid receptor
LigandBDBM50402494
Substrate/Competitorn/a
Meas. Tech.ChEMBL_886649 (CHEMBL2216234)
Ki 5±n/a nM
Citation Hunt, HJRay, NCHynd, GSutton, JSajad, MO'Connor, EAhmed, SLockey, PDaly, SBuckley, GClark, RDRoe, RBlasey, CBelanoff, J Discovery of a novel non-steroidal GR antagonist with in vivo efficacy in the olanzapine-induced weight gain model in the rat. Bioorg Med Chem Lett22:7376-80 (2012) 
 
Glucocorticoid receptor
Name:Glucocorticoid receptor
Type:Enzyme
Mol. Mass.:85656.87
Organism:Homo sapiens (Human)
Description:P04150
Residue:777
BDBM50402494
NameBDBM50402494
Synonyms:CHEMBL2204047
TypeSmall organic molecule
Emp. Form.C23H22Cl2N2O2
Mol. Mass.429.339
SMILESClc1cccc(Cc2c([nH]c(=O)[nH]c2=O)[C@@H]2CC[C@@H](CC2)c2ccccc2)c1Cl