Reaction Details
TargetGlucocorticoid receptor
LigandBDBM50402501
Substrate/Competitorn/a
Meas. Tech.ChEMBL_886649 (CHEMBL2216234)
Ki 3±n/a nM
Citation Hunt, HJRay, NCHynd, GSutton, JSajad, MO'Connor, EAhmed, SLockey, PDaly, SBuckley, GClark, RDRoe, RBlasey, CBelanoff, J Discovery of a novel non-steroidal GR antagonist with in vivo efficacy in the olanzapine-induced weight gain model in the rat. Bioorg Med Chem Lett22:7376-80 (2012) 
 
Glucocorticoid receptor
Name:Glucocorticoid receptor
Type:Enzyme
Mol. Mass.:85656.87
Organism:Homo sapiens (Human)
Description:P04150
Residue:777
BDBM50402501
NameBDBM50402501
Synonyms:CHEMBL2204040
TypeSmall organic molecule
Emp. Form.C24H26N2O2
Mol. Mass.374.4754
SMILESCc1cccc(Cc2c([nH]c(=O)[nH]c2=O)[C@@H]2CC[C@@H](CC2)c2ccccc2)c1