Reaction Details
TargetBone morphogenetic protein 1
LigandBDBM50402510
Substrate/Competitorn/a
Meas. Tech.ChEMBL_886679 (CHEMBL2216696)
IC50 10±n/a nM
Citation Turtle, EChow, NYang, CSosa, SBauer, UBrenner, MSolow-Cordero, DHo, WB Design and synthesis of procollagen C-proteinase inhibitors. Bioorg Med Chem Lett22:7397-401 (2012) 
 
Bone morphogenetic protein 1
Name:Bone morphogenetic protein 1
Type:PROTEIN
Mol. Mass.:111254.03
Organism:Homo sapiens (Human)
Description:ChEMBL_518962
Residue:986
BDBM50402510
NameBDBM50402510
Synonyms:CHEMBL2204087
TypeSmall organic molecule
Emp. Form.C26H30N4O6S
Mol. Mass.526.605
SMILESCOc1ccc(CCN(CCC(=O)NO)S(=O)(=O)c2ccc(NC(=O)NCc3ccccc3)cc2)cc1