Reaction Details
TargetFatty-acid amide hydrolase 1 [30-579]
LigandBDBM50402675
Substrate/Competitorn/a
Meas. Tech.ChEMBL_886874 (CHEMBL2211372)
IC50 0.7±n/a nM
Citation Tichenor, MSKeith, JMJones, WMPierce, JMMerit, JHawryluk, NSeierstad, MPalmer, JAWebb, MKarbarz, MJWilson, SJWennerholm, MLWoestenborghs, FBeerens, DLuo, LBrown, SMBoeck, MDChaplan, SRBreitenbucher, JG Heteroaryl urea inhibitors of fatty acid amide hydrolase: structure-mutagenicity relationships for arylamine metabolites. Bioorg Med Chem Lett22:7357-62 (2012) 
 
Fatty-acid amide hydrolase 1 [30-579]
Name:Fatty-acid amide hydrolase 1 [30-579]
Type:Single-pass membrane protein; homodimer
Mol. Mass.:60474.00
Organism:Rattus norvegicus (rat)
Description:P97612 (aa 30-579)
Residue:550
BDBM50402675
NameBDBM50402675
Synonyms:CHEMBL2207348
TypeSmall organic molecule
Emp. Form.C24H22ClN5O3
Mol. Mass.463.916
SMILESClc1ccc(Oc2cccc(CN3CCN(CC3)C(=O)Nc3noc4cnccc34)c2)cc1