Reaction Details
TargetSphingosine 1-phosphate receptor 1
LigandBDBM50402732
Substrate/Competitorn/a
Meas. Tech.ChEMBL_886921 (CHEMBL2211877)
EC50 4.7±n/a nM
Citation Aguilar, NMir, MGrima, PMLópez, MSegarra, VEsteban, LMoreno, IGodessart, NTarrasón, GDomenech, TVilella, DArmengol, CCórdoba, MSabaté, MCasals, DDomínguez, M Discovery of a novel class of zwitterionic, potent, selective and orally active S1P1 direct agonists. Bioorg Med Chem Lett22:7672-6 (2012) 
 
Sphingosine 1-phosphate receptor 1
Name:Sphingosine 1-phosphate receptor 1
Type:Enzyme
Mol. Mass.:42836.02
Organism:Homo sapiens (Human)
Description:P21453
Residue:382
BDBM50402732
NameBDBM50402732
Synonyms:CHEMBL2207783
TypeSmall organic molecule
Emp. Form.C23H23FN4O3S
Mol. Mass.454.517
SMILESCCCN(C(=O)c1ccccc1F)c1nnc(s1)-c1ccc(CN2CC(C2)C(O)=O)cc1