Reaction Details
TargetSphingosine 1-phosphate receptor 1
LigandBDBM50402739
Substrate/Competitorn/a
Meas. Tech.ChEMBL_886921 (CHEMBL2211877)
EC50 56±n/a nM
Citation Aguilar, NMir, MGrima, PMLópez, MSegarra, VEsteban, LMoreno, IGodessart, NTarrasón, GDomenech, TVilella, DArmengol, CCórdoba, MSabaté, MCasals, DDomínguez, M Discovery of a novel class of zwitterionic, potent, selective and orally active S1P1 direct agonists. Bioorg Med Chem Lett22:7672-6 (2012) 
 
Sphingosine 1-phosphate receptor 1
Name:Sphingosine 1-phosphate receptor 1
Type:Enzyme
Mol. Mass.:42836.02
Organism:Homo sapiens (Human)
Description:P21453
Residue:382
BDBM50402739
NameBDBM50402739
Synonyms:CHEMBL2207776
TypeSmall organic molecule
Emp. Form.C22H23FN4O3S
Mol. Mass.442.506
SMILESCCCCN(C(=O)c1ccccc1F)c1nnc(s1)-c1ccc(CNCC(O)=O)cc1