Reaction Details
TargetSphingosine 1-phosphate receptor 3
LigandBDBM50402729
Substrate/Competitorn/a
Meas. Tech.ChEMBL_886917 (CHEMBL2211873)
EC50 427000±n/a nM
Citation Aguilar, NMir, MGrima, PMLópez, MSegarra, VEsteban, LMoreno, IGodessart, NTarrasón, GDomenech, TVilella, DArmengol, CCórdoba, MSabaté, MCasals, DDomínguez, M Discovery of a novel class of zwitterionic, potent, selective and orally active S1P1 direct agonists. Bioorg Med Chem Lett22:7672-6 (2012) 
 
Sphingosine 1-phosphate receptor 3
Name:Sphingosine 1-phosphate receptor 3
Type:G Protein-Coupled Receptor (GPCR)
Mol. Mass.:42278.13
Organism:Homo sapiens (Human)
Description:Q99500
Residue:378
BDBM50402729
NameBDBM50402729
Synonyms:CHEMBL2207786
TypeSmall organic molecule
Emp. Form.C25H28N4O4S
Mol. Mass.480.579
SMILESCCCCN(C(=O)c1ccccc1OC)c1nnc(s1)-c1ccc(CN2CC(C2)C(O)=O)cc1