Reaction Details
TargetDelta-type opioid receptor
LigandBDBM50402772
Substrate/Competitorn/a
Meas. Tech.ChEMBL_887195 (CHEMBL2215303)
Ki 1.5±n/a nM
Citation Wentland, MPJo, SGargano, JMVanAlstine, MACohen, DJBidlack, JM Redefining the structure-activity relationships of 2,6-methano-3-benzazocines. Part 8. High affinity ligands for opioid receptors in the picomolar Ki range: oxygenated N-(2-[1,1'-biphenyl]-4-ylethyl) analogues of 8-CAC. Bioorg Med Chem Lett22:7340-4 (2012) 
 
Delta-type opioid receptor
Name:Delta-type opioid receptor
Type:G Protein-Coupled Receptor (GPCR)
Mol. Mass.:40382.98
Organism:Homo sapiens (Human)
Description:Competition binding assays were carried out using membrane preparations from transfected HN9.10 cells that constitutively expressed the delta opioid receptor.
Residue:372
BDBM50402772
NameBDBM50402772
Synonyms:CHEMBL2208350
TypeSmall organic molecule
Emp. Form.C35H42N2O3
Mol. Mass.538.7196
SMILESCOc1ccc(cc1OC)-c1ccc(CCNC(=O)c2ccc3CC4C(C)C(C)(CCN4CC4CC4)c3c2)cc1