Reaction Details
TargetMu-type opioid receptor
LigandBDBM50402776
Substrate/Competitorn/a
Meas. Tech.ChEMBL_887041 (CHEMBL2213832)
EC50 1.5±n/a nM
Citation Wentland, MPJo, SGargano, JMVanAlstine, MACohen, DJBidlack, JM Redefining the structure-activity relationships of 2,6-methano-3-benzazocines. Part 8. High affinity ligands for opioid receptors in the picomolar Ki range: oxygenated N-(2-[1,1'-biphenyl]-4-ylethyl) analogues of 8-CAC. Bioorg Med Chem Lett22:7340-4 (2012) 
 
Mu-type opioid receptor
Name:Mu-type opioid receptor
Type:G Protein-Coupled Receptor (GPCR)
Mol. Mass.:44789.51
Organism:Homo sapiens (Human)
Description:P35372
Residue:400
BDBM50402776
NameBDBM50402776
Synonyms:CHEMBL2208349
TypeSmall organic molecule
Emp. Form.C33H38N2O2
Mol. Mass.494.667
SMILESCC1C2Cc3ccc(cc3C1(C)CCN2CC1CC1)C(=O)NCCc1ccc(cc1)-c1ccccc1O