Reaction Details
TargetDelta-type opioid receptor
LigandBDBM50402775
Substrate/Competitorn/a
Meas. Tech.ChEMBL_887039 (CHEMBL2213830)
EC50 0.800000±n/a nM
Citation Wentland, MPJo, SGargano, JMVanAlstine, MACohen, DJBidlack, JM Redefining the structure-activity relationships of 2,6-methano-3-benzazocines. Part 8. High affinity ligands for opioid receptors in the picomolar Ki range: oxygenated N-(2-[1,1'-biphenyl]-4-ylethyl) analogues of 8-CAC. Bioorg Med Chem Lett22:7340-4 (2012) 
 
Delta-type opioid receptor
Name:Delta-type opioid receptor
Type:G Protein-Coupled Receptor (GPCR)
Mol. Mass.:40382.98
Organism:Homo sapiens (Human)
Description:Competition binding assays were carried out using membrane preparations from transfected HN9.10 cells that constitutively expressed the delta opioid receptor.
Residue:372
BDBM50402775
NameBDBM50402775
Synonyms:CHEMBL2208351
TypeSmall organic molecule
Emp. Form.C34H38N2O3
Mol. Mass.522.6771
SMILESCC1C2Cc3ccc(cc3C1(C)CCN2CC1CC1)C(=O)NCCc1ccc(cc1)-c1ccc2OCOc2c1