Reaction Details
TargetMu-type opioid receptor
LigandBDBM50402777
Substrate/Competitorn/a
Meas. Tech.ChEMBL_887196 (CHEMBL2215304)
Ki 0.005600±n/a nM
Citation Wentland, MPJo, SGargano, JMVanAlstine, MACohen, DJBidlack, JM Redefining the structure-activity relationships of 2,6-methano-3-benzazocines. Part 8. High affinity ligands for opioid receptors in the picomolar Ki range: oxygenated N-(2-[1,1'-biphenyl]-4-ylethyl) analogues of 8-CAC. Bioorg Med Chem Lett22:7340-4 (2012) 
 
Mu-type opioid receptor
Name:Mu-type opioid receptor
Type:G Protein-Coupled Receptor (GPCR)
Mol. Mass.:44789.51
Organism:Homo sapiens (Human)
Description:P35372
Residue:400
BDBM50402777
NameBDBM50402777
Synonyms:CHEMBL2208347
TypeSmall organic molecule
Emp. Form.C33H38N2O2
Mol. Mass.494.667
SMILESC[C@H]1[C@H]2Cc3ccc(cc3[C@]1(C)CCN2CC1CC1)C(=O)NCCc1ccc(cc1)-c1ccc(O)cc1