Reaction Details
TargetMu-type opioid receptor
LigandBDBM50402775
Substrate/Competitorn/a
Meas. Tech.ChEMBL_887196 (CHEMBL2215304)
Ki 0.001600±n/a nM
Citation Wentland, MPJo, SGargano, JMVanAlstine, MACohen, DJBidlack, JM Redefining the structure-activity relationships of 2,6-methano-3-benzazocines. Part 8. High affinity ligands for opioid receptors in the picomolar Ki range: oxygenated N-(2-[1,1'-biphenyl]-4-ylethyl) analogues of 8-CAC. Bioorg Med Chem Lett22:7340-4 (2012) 
 
Mu-type opioid receptor
Name:Mu-type opioid receptor
Type:G Protein-Coupled Receptor (GPCR)
Mol. Mass.:44789.51
Organism:Homo sapiens (Human)
Description:P35372
Residue:400
BDBM50402775
NameBDBM50402775
Synonyms:CHEMBL2208351
TypeSmall organic molecule
Emp. Form.C34H38N2O3
Mol. Mass.522.6771
SMILESCC1C2Cc3ccc(cc3C1(C)CCN2CC1CC1)C(=O)NCCc1ccc(cc1)-c1ccc2OCOc2c1