Reaction Details
TargetDelta-type opioid receptor
LigandBDBM50194264
Substrate/Competitorn/a
Meas. Tech.ChEMBL_887195 (CHEMBL2215303)
Ki 0.740000±n/a nM
Citation Wentland, MPJo, SGargano, JMVanAlstine, MACohen, DJBidlack, JM Redefining the structure-activity relationships of 2,6-methano-3-benzazocines. Part 8. High affinity ligands for opioid receptors in the picomolar Ki range: oxygenated N-(2-[1,1'-biphenyl]-4-ylethyl) analogues of 8-CAC. Bioorg Med Chem Lett22:7340-4 (2012) 
 
Delta-type opioid receptor
Name:Delta-type opioid receptor
Type:G Protein-Coupled Receptor (GPCR)
Mol. Mass.:40382.98
Organism:Homo sapiens (Human)
Description:Competition binding assays were carried out using membrane preparations from transfected HN9.10 cells that constitutively expressed the delta opioid receptor.
Residue:372
BDBM50194264
NameBDBM50194264
Synonyms:(+/-)-3-(cyclopropylmethyl)-1,2,3,4,5,6-hexahydro-cis-6,11-dimethyl-N-(2-[1,1'-biphenyl]-4-ylethyl)-2,6-methano-3-benzazocine-8-carboxamide CHEMBL377789 cis-rac-3-Cyclopropylmethyl-6,11-dimethyl-1,2,3,4,5,6-hexahydro-2,6-methano-benzo[d]azocine-8-carboxylic acid (2-biphenyl-4-yl-ethyl)-amide
TypeSmall organic molecule
Emp. Form.C33H38N2O
Mol. Mass.478.6676
SMILESC[C@H]1C2Cc3ccc(cc3[C@@]1(C)CCN2CC1CC1)C(=O)NCCc1ccc(cc1)-c1ccccc1