Reaction Details
TargetMu-type opioid receptor
LigandBDBM50402771
Substrate/Competitorn/a
Meas. Tech.ChEMBL_887043 (CHEMBL2213834)
IC50 45±n/a nM
Citation Wentland, MPJo, SGargano, JMVanAlstine, MACohen, DJBidlack, JM Redefining the structure-activity relationships of 2,6-methano-3-benzazocines. Part 8. High affinity ligands for opioid receptors in the picomolar Ki range: oxygenated N-(2-[1,1'-biphenyl]-4-ylethyl) analogues of 8-CAC. Bioorg Med Chem Lett22:7340-4 (2012) 
 
Mu-type opioid receptor
Name:Mu-type opioid receptor
Type:G Protein-Coupled Receptor (GPCR)
Mol. Mass.:44789.51
Organism:Homo sapiens (Human)
Description:P35372
Residue:400
BDBM50402771
NameBDBM50402771
Synonyms:CHEMBL2208354
TypeSmall organic molecule
Emp. Form.C32H38N2O2
Mol. Mass.482.6563
SMILESCOc1ccc2cc(CCNC(=O)c3ccc4CC5C(C)C(C)(CCN5CC5CC5)c4c3)ccc2c1