Reaction Details
TargetKappa-type opioid receptor
LigandBDBM50224879
Substrate/Competitorn/a
Meas. Tech.ChEMBL_887048 (CHEMBL2213839)
Ki 0.200000±n/a nM
Citation Wentland, MPJo, SGargano, JMVanAlstine, MACohen, DJBidlack, JM Redefining the structure-activity relationships of 2,6-methano-3-benzazocines. Part 8. High affinity ligands for opioid receptors in the picomolar Ki range: oxygenated N-(2-[1,1'-biphenyl]-4-ylethyl) analogues of 8-CAC. Bioorg Med Chem Lett22:7340-4 (2012) 
 
Kappa-type opioid receptor
Name:Kappa-type opioid receptor
Type:G Protein-Coupled Receptor (GPCR)
Mol. Mass.:42648.76
Organism:Homo sapiens (Human)
Description:P41145
Residue:380
BDBM50224879
NameBDBM50224879
Synonyms:(6S,11R)-3-cyclopropylmethyl-6,11-dimethyl-1,2,3,4,5,6-hexahydro-2,6-methano-benzo[d]azocine-8-carboxylic acid (2-naphthalen-2-yl-ethyl)-amide | CHEMBL399344
TypeSmall organic molecule
Emp. Form.C31H36N2O
Mol. Mass.452.6303
SMILESC[C@H]1C2Cc3ccc(cc3[C@@]1(C)CCN2CC1CC1)C(=O)NCCc1ccc2ccccc2c1