Reaction Details
TargetMetabotropic glutamate receptor 5
LigandBDBM50402787
Substrate/Competitorn/a
Meas. Tech.ChEMBL_887238 (CHEMBL2215794)
Ki>30000±n/a nM
Citation Rodriguez, ALZhou, YWilliams, RDavid Weaver, CVinson, PNDawson, ESSteckler, TLavreysen, HMackie, CBartolomé, JMMacdonald, GJScott Daniels, JNiswender, CMJones, CKJeffrey Conn, PLindsley, CWStauffer, SR Discovery and SAR of a novel series of non-MPEP site mGlu5 PAMs based on an aryl glycine sulfonamide scaffold. Bioorg Med Chem Lett22:7388-92 (2012) 
 
Metabotropic glutamate receptor 5
Name:Metabotropic glutamate receptor 5
Type:Enzyme
Mol. Mass.:131900.14
Organism:Rattus norvegicus (Rat)
Description:P31424
Residue:1203
BDBM50402787
NameBDBM50402787
Synonyms:CHEMBL2208405
TypeSmall organic molecule
Emp. Form.C14H16ClF3N2O3S
Mol. Mass.384.802
SMILESCS(=O)(=O)N(CC(=O)NCC1CC1)c1cc(ccc1Cl)C(F)(F)F