Reaction Details
TargetPotassium voltage-gated channel subfamily H member 2
LigandBDBM50402813
Substrate/Competitorn/a
Meas. Tech.ChEMBL_887250 (CHEMBL2215806)
IC50 251.19±n/a nM
Citation Furber, MAlcaraz, LLuckhurst, CBahl, ABeaton, HBowers, KCollington, JDenton, RDonald, DKinchin, EMacDonald, CRigby, ARiley, RSoars, MSpringthorpe, BWebborn, P Discovery and evolution of phenoxypiperidine hydroxyamide dual CCR3/H1 antagonists. Part I. Bioorg Med Chem Lett22:7702-6 (2012) 
 
Potassium voltage-gated channel subfamily H member 2
Name:Potassium voltage-gated channel subfamily H member 2
Type:Multi-pass membrane protein
Mol. Mass.:126672.65
Organism:Homo sapiens (Human)
Description:Q12809
Residue:1159
BDBM50402813
NameBDBM50402813
Synonyms:CHEMBL2208429
TypeSmall organic molecule
Emp. Form.C22H24Cl2N4O3
Mol. Mass.463.357
SMILESO[C@H](CNC(=O)c1n[nH]c2ccccc12)CN1CCC(CC1)Oc1ccc(Cl)c(Cl)c1